{"text_format":"1","workbook":"xlsx","n_sheets":2,"sheets":["Tabelle1","T"],"not_rendered":{"charts":0,"images":2,"macros":1,"external_links":0,"defined_names":3,"comments":0,"pivot_tables":0},"unopened":[],"bounds":{"document_bytes":16777216,"sheet_cells":100000,"rows_first":2000,"rows_last":500,"rows_between":2000,"halvings":0,"cell_chars":16384,"cell_head_chars":4096},"cells_cut":0,"cells_raw":0,"read":"whole","date_system":"1900"}

{"sheet":"Tabelle1","index":0,"n_rows":25,"n_cols":6,"rows_kept":25,"cut":false,"hidden":false,"merged":[]}
[null,"Stadtwerke Schwetzingen GmbH & Co. KG"]
[null,"Netzentgeltrechner Gas "]
[]
[null,"Kunden ohne Leistungsmessung"]
[]
[null,"Jahrsarbeit (Wert <= 1.500.000 kWh)",10000,"kWh","Entgelt Arbeitspreis & Grundpreis",{"$f":"IF(AND((Tabelle1!C6>=T!A26),(Tabelle1!C6<=T!B26)),(T!D26*10^-2*Tabelle1!C6)+T!C26,IF(AND((Tabelle1!C6>=T!A27),(Tabelle1!C6<=T!B27)),(T!D27*10^-2*Tabelle1!C6)+T!C27,IF(AND((Tabelle1!C6>=T!A28),(Tabelle1!C6<=T!B28)),(T!D28*10^-2*Tabelle1!C6)+T!C28,IF(AND((Tabelle1!C6>=T!A29),(Tabelle1!C6<=T!B29)),(T!D29*10^-2*Tabelle1!C6)+T!C29,IF(AND((Tabelle1!C6>=T!A30),(Tabelle1!C6<=T!B30)),(T!D30*10^-2*Tabelle1!C6)+T!C30,IF(AND((Tabelle1!C6>=T!A31),(Tabelle1!C6<=T!B31)),(T!D31*10^-2*Tabelle1!C6)+T!C31,IF(AND((Tabelle1!C6>=T!A32),(Tabelle1!C6<=T!B32)),(T!D32*10^-2*Tabelle1!C6)+T!C32,\"Falsche Zahl\")))))))","v":270.88}]
[null,"Zählergröße",3,null,"Entgelt Messstellenbetrieb",{"$f":"INDEX(T!B46:B59,T!E46)","v":58.29}]
[null,"Ableseintervall",null,null,"Entgelt Messung",{"$f":"INDEX(T!B65:B72,T!E65)","v":4.01}]
[null,"Abrechnungsintervall",null,null,"Entgelt Abrechnung",{"$f":"INDEX(T!B79:B84,T!E79)","v":0}]
[null,null,null,null,"Netzentgelt jährlich netto ",{"$f":"SUM(F6:F9)","v":333.18}]
[]
[null,"mit gültigem Preis:  01.01.2026 - 31.12.2026",null,null,"inklusive vorgelagerter Netzkosten"]
[]
[null,"Kunden mit Leistungsmessung"]
[]
[null,"Jahrsarbeit",1500000,"kWh","Entgelt Arbeitspreis",{"$f":"Tabelle1!C16*T!B38*10^-2","v":11068.5}]
[null,"Jahresleistung",1000,"kW","Entgelt Leistungspreis",{"$f":"Tabelle1!C17*T!B39","v":28485.1}]
[null,"Ableseintervall",null,null,"Entgelt Messung",{"$f":"INDEX(T!B70:B72,T!F70)","v":153.82}]
[null,"Zählergröße",null,null,"Entgelt Messstellenbetrieb",{"$f":"INDEX(T!B46:B59,T!F46)","v":40.69}]
[null,"Datenlogger",null,null,"Entgelt Messstellenbetrieb",{"$f":"INDEX(T!B58:B59,T!F58)","v":253.33}]
[null,"Zusatzgerät",null,null,"Entgelt Messstellenbetrieb",{"$f":"INDEX(T!B56:B57,T!F56)","v":357.92}]
[null,"Abrechnungsintervall",null,null,"Entgelt Abrechnung",{"$f":"INDEX(T!B83:B84,T!F83)","v":0}]
[null,null,null,null,"Netzentgelt jährlich netto",{"$f":"SUM(F16:F22)","v":40359.360000000001}]
[]
[null,"mit gültigem Preis:  01.01.2026 - 31.12.2026",null,null,"inklusive vorgelagerter Netzkosten"]

{"sheet":"T","index":1,"n_rows":106,"n_cols":6,"rows_kept":106,"cut":false,"hidden":true,"merged":[[22,0,22,1]]}
[]
[]
[]
[]
[]
[]
[]
[]
[]
["Stand: 13.02.2026"]
["Preisblatt für die Netznutzung bis zum virtuellen Handelspunkt"]
[]
["Die Stadtwerke Schwetzingen GmbH & Co. KG ist gemäß den Vorgaben der Anreizregulierungs-"]
["verordnung (ARegV) verpflichtet, die Erlösobergrenze und die daraus resultierenden Netzentgelte"]
["zum 01.01.2026 anzupassen."]
["Die ab dem 01.01.2026 gültigen Entgelte sind nachfolgend aufgeführt."]
[]
[]
[]
[]
["1.1  Netzentgelte für Entnahme ohne Leistungsmessung 1",null,null,null,"Index Variable OL","Index Variable ML"]
[]
["Jahresarbeit",null,"Grundpreis","Arbeitspreis"]
["von","bis"]
["kWh/a","kWh/a","€/a","ct/kWh"]
[0,0,0,0]
[0,1000,2.4,3.0808]
[1001,4000,6,2.7208000000000001]
[4001,50000,10.8,2.6008]
[50001,300000,31.2,2.56]
[300001,1000000,144,2.5224000000000002]
[1000001,1500000,588,2.4780000000000002]
[]
[]
[]
["1.2  Netzentgelte für Entnahme mit Leistungsmessung 1"]
[]
["Arbeitspreis",0.7379,"ct/kWh"]
["Leistungspreis",28.485099999999999,"€/kW"]
[]
[]
[]
["1.3  Entgelte Messstellenbetrieb 1"]
[]
["Zählergröße","€/Ausspeisepunkt/a"]
[null,0,null,null,6,5]
["G 4 bis G 6",12.22]
["G 10 bis G 16",14.67]
["G 25",27.39]
["G 40",40.69]
["G 65",58.29]
["G 100",64.84]
["G 160",71.36]
["G 250",75.73]
["G 400",140.36000000000001]
["ohne",0,null,null,null,2]
["Mengenumwerter",357.92]
["ohne",0,null,null,null,2]
["Datenspeicher",253.33]
[]
[]
["1.4  Entgelte für die Messung"]
[]
["Ableseintervall","€/Ausspeisepunkt/a"]
[null,0,null,null,2]
["Standartlastprofil (SLP) - jährlich",4.01]
["Standartlastprofil (SLP) - 1/2 jährlich",8.02]
["Standartlastprofil (SLP) - 1/4 jährlich",16.04]
["Standartlastprofil (SLP) - monatlich",48.12]
[null,0,null,null,null,2]
["Registrierende Leistungsmessung (RLM)",153.82]
["Registrierende Leistungsmessung (RLM)stündlich",1051.2]
[]
[]
[]
["1.5 Entgelte für die Abrechnung 1"]
[]
["Abrechnungsintervall","€/Ausspeisepunkt/a"]
[null,0,null,null,2]
["einmal jährlich (SLP)",0]
["1/2 jährlich",0]
["1/4 jährlich",0]
[null,0,null,null,null,2]
["monatlich (RLM)",0]
[]
["Konzessionsabgaben Gas im Netzgebiet der Stadtwerke Schwetzingen GmbH & Co. KG"]
[]
["Die Konzessionsabgabe ist additiver Bestandteil des Netzentgeltes und in den oben aufgeführten"]
["Preisen nicht enthalten. Die Konzessionsabgabe richtet sich nach der jeweils geltenden"]
["Konzessionsabgabenverordnung (KAV)."]
[]
[]
["Netzgebiet","Anwendungsbereich",null,"Konzessionsabgabe"]
[null,null,null,"in ct/kWh"]
["Schwetzingen","Tarifkunden",null,0.22]
["Oftersheim"]
["Plankstadt","Tarifkunden mit Gasverwendung",null,0.22]
[null,"ausschließlich für Kochen"]
[null,"und Warmwasser"]
[]
[null,"Sondervertragskunden",null,0.03]
[]
["1 zuzüglich Steuern, Abgaben und andere Zuschläge (z.B. MwSt, Konzessionsabgabe,...) soweit gesetzlich oder "]
["aufgrund anderer rechtlicher Vorgaben zulässig und der Höhe und dem Grund nach üblich."]
[]
["Es werden Rabatte gem. § 3 KAV gewährt."]